Notice:
If you happen to see a question you know the answer to, please do chime in and help your fellow community members. We encourage our fourm members to be more involved, jump in and help out your fellow researchers with their questions. GATK forum is a community forum and helping each other with using GATK tools and research is the cornerstone of our success as a genomics research community.We appreciate your help!

Test-drive the GATK tools and Best Practices pipelines on Terra


Check out this blog post to learn how you can get started with GATK and try out the pipelines in preconfigured workspaces (with a user-friendly interface!) without having to install anything.
Attention:
We will be out of the office on October 14, 2019, due to the U.S. holiday. We will return to monitoring the forum on October 15.

Error while installing picard

rafayrafay PakistanMember

sudo ./gradlew shadowJar

Downloading http://services.gradle.org/distributions/gradle-3.1-all.zip
............................................................................................................. ............................................................................................................. ............................................................................................................. ............................................................................................................. ............................................................................................................. ............................................................................................................. ............................................................................................................. ............................................................................................................. ............................................................................................................. ............................................................................................................. ............................................................................................................. ............................................................................................................. ............................................................................................................. ............................................................................................................. ............................................................................................................. ............................................................................................................. ............................................................................................................. ............................................................................................................. ............................................................................................................. ............................................................................................................. ............................................................................................................. ............................................................................................................. ............................................................................................................. ............................................................................................................. ............................................................................................................. ....................................................................................................... ....................................................................................................... ....................................................................................................... ....................................................................................................... ....................................................................................................... ....................................................................................................... ....................................................................................................... ....................................................................................................... ....................................................................................................... ....................................................................................................... ....................................................................................................... ....................................................................................................... ....................................................................................................... ....................................................................................................... ....................................................................................................... ....................................................................................................... ...........................................................................
Unzipping /root/.gradle/wrapper/dists/gradle-3.1-all/7v522598rw1b93jkcneehqz1n/gradle-3.1-all.zip to /r oot/.gradle/wrapper/dists/gradle-3.1-all/7v522598rw1b93jkcneehqz1n
Set executable permissions for: /root/.gradle/wrapper/dists/gradle-3.1-all/7v522598rw1b93jkcneehqz1n/gr adle-3.1/bin/gradle
Starting a Gradle Daemon (subsequent builds will be faster)

FAILURE: Build failed with an exception.

  • Where:
    Build file '/results/work/tools/picard/build.gradle' line: 17

  • What went wrong:
    Error resolving plugin [id: 'com.palantir.git-version', version: '0.5.1']

    Could not GET 'https://plugins.gradle.org/api/gradle/3.1/plugin/use/com.palantir.git-version/0.5.1'.
    java.security.ProviderException: java.security.InvalidKeyException: EC parameters error

  • Try:
    Run with --stacktrace option to get the stack trace. Run with --info or --debug option to get more log output.

BUILD FAILED

Total time: 7 mins 45.855 secs

Tagged:

Answers

Sign In or Register to comment.